*HEADING
EC3RSRS2: PRESSURE AND HYDROSTATIC PRESSURE FOR 3-D SOLIDS  [C3D27R]
*PREPRINT,ECHO=YES,HISTORY=YES,MODEL=YES
*NODE
*ELEMENT,TYPE=C3D27RH, ELSET=EALL
*SOLID SECTION,MATERIAL=A1, ELSET=EALL, ORIENTATION=ORI
*MATERIAL,NAME=A1
*ELASTIC,TYPE=ISOTROPIC
 30.0E6,0.3
*ORIENTATION,NAME=ORI
*BOUNDARY
 1,1,3
 2,2
 4,3
 5,1
*STEP
*STATIC
*DLOAD,OP=NEW
 1, P1, 1000.0
 1, P2, 1000.0
 1, P3, 1000.0
 1, P4, 1000.0
 1, P5, 1000.0
 1, P6, 1000.0
*CLOAD
 2,1,  -500.
 3,1,  -166.6667
 3,2,  -166.6667
 3,3,   333.33333
 4,1,  -166.6667
 4,2,  -500.0
 5,2,   166.666
 5,3,  -333.33333
*OUTPUT,FIELD
*ELEMENT OUTPUT
 S,
 COORD,
 E,
 LOADS,
*OUTPUT,HISTORY,FREQUENCY=1
*ENERGY OUTPUT
*OUTPUT,FIELD
*NODE OUTPUT
 U,COORD
*NODE PRINT
 U,COORD
*EL PRINT
 S,
 COORD,
 E,
 LOADS,
*END STEP
*STEP
*STATIC
*DLOAD,OP=MOD
1,HP3,1000.,1.0,0.0
1,HP4,1000.,1.0,0.0
1,HP5,1000.,1.0,0.0
1,HP6,1000.,1.0,0.0
*OUTPUT,FIELD
*ELEMENT OUTPUT
S,COORD,
E,
*OUTPUT,FIELD
*NODE OUTPUT
U,COORD
*END STEP