*HEADING
EC3RSFDA: CORIOLIS LOAD  [C3D27]
*PREPRINT,ECHO=YES,HISTORY=NO,MODEL=NO
*NODE
*NGEN,NSET=ALL
*NSET,NSET=NS3
*NSET,NSET=NS1
*NSET,NSET=NS6
*ELEMENT,TYPE=C3D27, ELSET=EALL
*SOLID SECTION,MATERIAL=A1, ELSET=EALL
*MATERIAL,NAME=A1
*ELASTIC
 3.E6,0.3
*STEP
*STATIC
.0001,.0001
*BOUNDARY
 ALL,1,1,.001
 ALL,2,2,.0005
 ALL,3,3
*OUTPUT,HISTORY,FREQUENCY=1
*ENERGY OUTPUT
*OUTPUT,FIELD
*NODE OUTPUT
 RF,
*DLOAD
1, CORIO,5.,-1000.,3.5,-3.5,0.,1.,0.
*EL PRINT
 LOADS,
*OUTPUT,FIELD
*ELEMENT OUTPUT
 LOADS,
*NODE PRINT
 RF,
*END STEP