*HEADING
EC3RSFD6: FOUNDATION TYPE F5  [C3D27]
*PREPRINT,ECHO=YES,HISTORY=NO,MODEL=NO
*NODE
*NGEN,NSET=ALL
*NSET,NSET=NS3
*NSET,NSET=NS1
*NSET,NSET=NS6
*ELEMENT,TYPE=C3D27, ELSET=EALL
*SOLID SECTION,MATERIAL=A1, ELSET=EALL
*MATERIAL,NAME=A1
*ELASTIC
 3.E6,0.3
*FOUNDATION
1,F5,300.
*STEP,PERTURBATION
*STATIC
*BOUNDARY
ALL,1,2
ALL,3,,-0.1
*OUTPUT,HISTORY,FREQUENCY=1
*ENERGY OUTPUT
*OUTPUT,FIELD
*NODE OUTPUT
 RF,
*EL PRINT,FREQ=0
*NODE PRINT
 RF,
*END STEP