*HEADING
EC3KSHD3: FOUNDATION TYPE F2  [C3D20H]
*PREPRINT,ECHO=YES,HISTORY=NO,MODEL=NO
*NODE
*NGEN,NSET=ALL
*ELEMENT,TYPE=C3D20H, ELSET=EALL
*SOLID SECTION,MATERIAL=A1, ELSET=EALL
*MATERIAL,NAME=A1
*ELASTIC
  3.E+6,0.3
*FOUNDATION
 1,F2,300.
*STEP,PERTURBATION
*STATIC
*BOUNDARY
 ALL,1
 ALL,3
 ALL,2,,0.1
*OUTPUT,HISTORY,FREQUENCY=1
*ENERGY OUTPUT
*OUTPUT,FIELD
*NODE OUTPUT
 RF,
*EL PRINT,FREQ=0
*NODE PRINT
 RF,
*END STEP