*HEADING
EC3KSFD1: DLOADS AND *TEMPERATURE FOR STRESS-DISPLACEMENT ELEMENTS  [C3D20]
*PREPRINT,ECHO=YES,HISTORY=NO,MODEL=NO
*NODE
*NGEN,NSET=ALL
*NSET,NSET=NS1
*NSET,NSET=NS2
*NSET,NSET=NS3
*ELEMENT,TYPE=C3D20, ELSET=EALL
*SOLID SECTION,MATERIAL=A1, ELSET=EALL
*MATERIAL,NAME=A1
*ELASTIC
 3.E6,0.3
*DENSITY
 10.0,
*EXPANSION
 .0001,
*INITIAL CONDITIONS,TYPE=TEMPERATURE
 ALL,-10.
*BOUNDARY
 ALL,1,3
*STEP,PERTURBATION
*STATIC
*OUTPUT,HISTORY,FREQUENCY=1
*ENERGY OUTPUT
*OUTPUT,FIELD
*NODE OUTPUT
 RF,
*DLOAD
 1,BX,1000.
*EL PRINT,TOTALS=YES
 LOADS,
 IVOL,
 EVOL,
*OUTPUT,FIELD
*ELEMENT OUTPUT
 LOADS,
 IVOL,
 EVOL,
*NODE PRINT
 RF,
*END STEP
*STEP,PERTURBATION
*STATIC
*DLOAD
 1,BY,2000.
*END STEP
*STEP,PERTURBATION
*STATIC
*DLOAD
 1,BZ,3000.
*END STEP
*STEP,PERTURBATION
*STATIC
*DLOAD
 1,GRAV,300.0,1.0,0.0,0.0
*END STEP
*STEP,PERTURBATION
*STATIC
*DLOAD
 1,CENT,300.,-1000.,3.5,-3.5,0.,1.,0.
*END STEP
*STEP,PERTURBATION
*STATIC
*DLOAD
 1,CENTRIF,30.,-1000,3.5,-3.5,0.,1.,0.
*END STEP
*STEP,PERTURBATION
*STATIC
*DLOAD
 1,P1,1000.
*END STEP
*STEP,PERTURBATION
*STATIC
*DLOAD
 1,P2,1000.
*END STEP
*STEP,PERTURBATION
*STATIC
*DLOAD
 1,P3,1000.
*END STEP
*STEP,PERTURBATION
*STATIC
*DLOAD
 1,P4,1000.
*END STEP
*STEP,PERTURBATION
*STATIC
*DLOAD
 1,P5,1000.
*END STEP
*STEP,PERTURBATION
*STATIC
*DLOAD
 1,P6,1000.
*END STEP
*STEP,PERTURBATION
*STATIC
*DLOAD
 1,HP1,3000.,0.,-7.
*END STEP
*STEP,PERTURBATION
*STATIC
*DLOAD
 1,HP2,3000.,0.,-7.
*END STEP
*STEP,PERTURBATION
*STATIC
*DLOAD
 1,HP3,3000.,0.,-7.
*END STEP
*STEP,PERTURBATION
*STATIC
*DLOAD
 1,HP4,3000.,0.,-7.
*END STEP
*STEP,PERTURBATION
*STATIC
*DLOAD
 1,HP5,3000.,0.,-7.
*END STEP
*STEP,PERTURBATION
*STATIC
*DLOAD
 1,HP6,3000.,0.,-7.
*END STEP
*STEP,PERTURBATION
*STATIC
*TEMPERATURE
 ALL,40.
*OUTPUT,FIELD
*ELEMENT OUTPUT
 S,
*OUTPUT,FIELD
*NODE OUTPUT
 RF,
*EL PRINT
 S,
*NODE PRINT
 RF,
*END STEP
*STEP,PERTURBATION
*STATIC
*BOUNDARY,OP=NEW
 NS1,1
 NS2,2
 NS3,3
*TEMPERATURE,OP=MOD
 ALL,40.
*OUTPUT,FIELD
*NODE OUTPUT
 U,
*EL PRINT,FREQ=0
*NODE PRINT
 U,
*END STEP