*HEADING
EC3ISFD6: FOUNDATION TYPE F5  [C3D15V]
*PREPRINT,ECHO=YES,HISTORY=NO,MODEL=NO
*NODE
*NGEN,NSET=ALL
*ELEMENT,TYPE=C3D15V,ELSET=ELEMS
*MATERIAL,NAME=MELEMS
*ELASTIC
 3.E6,0.3
*SOLID SECTION,MATERIAL=MELEMS,ELSET=ELEMS
*FOUNDATION
 1,F5,300.
*STEP,PERTURBATION
*STATIC
*BOUNDARY
 ALL,1,,-0.1
 ALL,2
 ALL,3
*OUTPUT,HISTORY,FREQUENCY=1
*ENERGY OUTPUT
*OUTPUT,FIELD
*NODE OUTPUT
 RF,
*EL PRINT,FREQ=0
*NODE PRINT
 RF,
*END STEP