*HEADING
EC3ASFP2: THREE-DIMENSIONAL SOLID PATCH TEST  [C3D10]
*PREPRINT,ECHO=YES,HISTORY=NO,MODEL=NO
*NODE,NSET=OUT
*NODE
*NGEN,NSET=OUT
*NGEN
*ELEMENT,TYPE=C3D10, ELSET=EALL
*ELSET,ELSET=EL3
*SOLID SECTION,MATERIAL=A1, ELSET=EALL
*MATERIAL,NAME=A1
*ELASTIC,TYPE=ISOTROPIC
 1.E6,.25
*STEP,PERTURBATION
*STATIC
*BOUNDARY
10,1,,.5E-3
10,2,,.5E-3
10,3,,1.E-3
30,1,,1.5E-3
30,2,,1.E-3
30,3,,1.5E-3
90,1,,1.E-3
90,2,,.5E-3
***
*****
*ENERGY FILE
*ENERGY PRINT
*EL PRINT
 S,
 E,
*EL PRINT,POSITION=NODES
 S,
 E,
*EL PRINT,POSITION=AVERAGED AT NODES
 S,
 E,
*EL PRINT,POSITION=CENTROID
 S,
 E,
*EL FILE
 S,
 E,
*EL FILE,POSITION=NODES
 S,
 E,
*EL FILE,POSITION=AVERAGED AT NODES
 S,
 E,
*EL FILE,POSITION=CENTROID
 S,
 E,
*ENDSTEP
*STEP,NLGEOM
*STATIC
*DLOAD
7, P4, -10000.
9, P3, -10000.
12, P4, -10000.
14, P3, -10000.
17, P4, -10000.
19, P3, -10000.
22, P4, -10000.
24, P3, -10000.
27, P4, -10000.
29, P3, -10000.
32, P4, -10000.
34, P3, -10000.
*BOUNDARY
10,1,2
70,1,3
90,2,3
270,1
270,3
*ENERGY FILE
*EL PRINT,SUMMARY=NO,ELSET=EL3
S,
E,
*EL FILE,ELSET=EL3
S,
E,
*NODE PRINT,SUMMARY=NO
U,RF
*NODE FILE
U,RF
*END STEP
*STEP,PERTURBATION
*STATIC
*BOUNDARY
10,1,,.5E-3
10,2,,.5E-3
10,3,,1.E-3
30,1,,1.5E-3
30,2,,1.E-3
30,3,,1.5E-3
90,1,,1.E-3
90,2,,.5E-3
***
*****
*ENERGY FILE
*ENERGY PRINT
*EL PRINT
 S,
 E,
*EL PRINT,POSITION=NODES
 S,
 E,
*EL PRINT,POSITION=AVERAGED AT NODES
 S,
 E,
*EL PRINT,POSITION=CENTROID
 S,
 E,
*EL FILE
 S,
 E,
*EL FILE,POSITION=NODES
 S,
 E,
*EL FILE,POSITION=AVERAGED AT NODES
 S,
 E,
*EL FILE,POSITION=CENTROID
 S,
 E,
*END STEP