*HEADING
EC3ASFD4: FOUNDATION TYPE F3  [C3D10]
*PREPRINT,ECHO=YES,HISTORY=NO,MODEL=NO
*NODE
*NGEN,NSET=ALL
*ELEMENT,TYPE=C3D10,ELSET=ELEMS
*SOLID SECTION,MATERIAL=MAT, ELSET=ELEMS
*MATERIAL,NAME=MAT
*ELASTIC
 3.E6,0.3
*FOUNDATION
 3,F3,300.
 4,F3,300.
*STEP,PERTURBATION
*STATIC
*BOUNDARY
 ALL,1
 ALL,2,,0.1
 ALL,3
*OUTPUT,HISTORY,FREQUENCY=1
*ENERGY OUTPUT
*OUTPUT,FIELD
*NODE OUTPUT
 RF,
*EL PRINT,FREQ=0
*NODE PRINT
 RF,
*END STEP