*HEADING
EC3ADFDC: DFLUX, FILM, AND RADIATION FOR HEAT TRANSFER ELEMENTS  [DC3D10]
*PREPRINT,ECHO=YES,HISTORY=NO,MODEL=NO
*RESTART,WRITE
*NODE
*ELEMENT,TYPE=DC3D10,ELSET=ALLELS
*SOLID SECTION,MATERIAL=A1, ELSET=ALLELS
*surface,NAME=SIDE
2,S3
3,S3
*PHYSICAL CONSTANTS, ABSOLUTE ZERO=-460.,STEFAN BOLTZMANN=5.0E-8
*MATERIAL,NAME=A1
*CONDUCTIVITY
 3.77E-5,
*DENSITY
 82.9,
*SPECIFIC HEAT
 .39,
*NSET,NSET=FIX1
*NSET,NSET=FIX2
*NSET,NSET=FIX3
*NSET,NSET=FIX4
*NSET,NSET=FIX5
*NSET,NSET=FIX6
*BOUNDARY
 FIX1,11
*STEP
*HEAT TRANSFER, STEADY STATE
*NODE PRINT
 NT,RFL
*OUTPUT,FIELD
*NODE OUTPUT
 NT,RFL
*EL PRINT,FREQ=0
*OUTPUT,FIELD
*ELEMENT OUTPUT
*DFLUX
 ALLELS, BF, .3
*END STEP
*STEP
*HEAT TRANSFER, STEADY STATE
*DFLUX,OP=NEW
*FILM, OP=NEW
 2, F3, 75., .103
 3, F3, 75., .103
*END STEP
*STEP
*HEAT TRANSFER,STEADY STATE
*FILM,OP=NEW
 1, F1, 75., .103
 4, F1, 75., .103
*BOUNDARY,OP=NEW
 FIX2, 11
*END STEP
*STEP
*HEAT TRANSFER,STEADY STATE
*FILM,OP=NEW
 1, F2, 75., .103
 2, F1, 75., .103
*BOUNDARY,OP=NEW
 FIX5, 11
*END STEP
*STEP
*HEAT TRANSFER,STEADY STATE
*FILM,OP=NEW
 1, F3, 75., .103
 3, F2, 75., .103
*BOUNDARY,OP=NEW
 FIX6, 11
*END STEP
*STEP
*HEAT TRANSFER,STEADY STATE
*FILM,OP=NEW
 3, F1, 75., .103
 4, F3, 75., .103
*SECTION PRINT,NAME=SIDE1,SURFACE=SIDE,AXES=LOCAL
SOH,SOAREA
*SECTION FILE,NAME=SIDE1,SURFACE=SIDE,AXES=LOCAL
SOH,SOAREA
*BOUNDARY,OP=NEW
 FIX3, 11
*END STEP
*STEP
*HEAT TRANSFER,STEADY STATE
*FILM,OP=NEW
 2, F2, 75., .103
 4, F4, 75., .103
*BOUNDARY,OP=NEW
 FIX4, 11
*END STEP
*STEP
*HEAT TRANSFER, STEADY STATE
*FILM, OP=NEW
*RADIATE, OP=NEW
 2, R3, 75., 1.E-6
 3, R3, 75., 1.E-6
*BOUNDARY,OP=NEW
 FIX1, 11
*END STEP
*STEP
*HEAT TRANSFER, STEADY STATE
*RADIATE, OP=NEW
 1, R1, 75., 1.E-6
 4, R1, 75., 1.E-6
*BOUNDARY,OP=NEW
 FIX2,11
*END STEP
*STEP
*HEAT TRANSFER, STEADY STATE
*RADIATE, OP=NEW
 1, R2, 75., 1.E-6
 2, R1, 75., 1.E-6
*BOUNDARY,OP=NEW
 FIX5,11
*END STEP
*STEP
*HEAT TRANSFER, STEADY STATE
*RADIATE, OP=NEW
 1, R3, 75., 1.E-6
 3, R2, 75., 1.E-6
*BOUNDARY, OP=NEW
 FIX6,11
*END STEP
*STEP
*HEAT TRANSFER, STEADY STATE
*RADIATE, OP=NEW
 3, R1, 75., 1.E-6
 4, R3, 75., 1.E-6
*BOUNDARY,OP=NEW
 FIX3,11
*END STEP
*STEP
*HEAT TRANSFER, STEADY STATE
*RADIATE, OP=NEW
 4, R4, 75., 1.E-6
 2, R2, 75., 1.E-6
*BOUNDARY, OP=NEW
 FIX4,11
*END STEP
*STEP
*HEAT TRANSFER, STEADY STATE
*BOUNDARY, OP=NEW
 FIX2, 11
*RADIATE, OP=NEW
*DFLUX, OP=NEW
 1, S1, .3
 4, S1, .3
*END STEP
*STEP
*HEAT TRANSFER, STEADY STATE
*BOUNDARY, OP=NEW
 FIX1, 11
*DFLUX,OP=NEW
 2, S3, .3
 3, S3, .3
*END STEP
*STEP
*HEAT TRANSFER, STEADY STATE
*BOUNDARY, OP=NEW
 FIX5, 11
*DFLUX,OP=NEW
 1, S2, .3
 2, S1, .3
*END STEP
*STEP
*HEAT TRANSFER, STEADY STATE
*BOUNDARY, OP=NEW
 FIX6, 11
*DFLUX,OP=NEW
 1, S3, .3
 3, S2, .3
*END STEP
*STEP
*HEAT TRANSFER, STEADY STATE
*BOUNDARY, OP=NEW
 FIX3, 11
*DFLUX,OP=NEW
 3, S1, .3
 4, S3, .3
*END STEP
*STEP
*HEAT TRANSFER, STEADY STATE
*BOUNDARY, OP=NEW
 FIX4, 11
*DFLUX,OP=NEW
 2, S2, .3
 4, S4, .3
*END STEP