*HEADING
Test of angular acceleration loading for C3D8RH elements.
*RESTART,WRITE
*NODE,NSET=NALL
*ELEMENT,TYPE=C3D8RH,ELSET=EALL
*SOLID SECTION,MATERIAL=STEEL,ELSET=EALL
*MATERIAL,NAME=STEEL
*ELASTIC
30.E6,.33
*DENSITY
2000.,
*BOUNDARY
NALL,1,3
*STEP
*STATIC
*DLOAD
EALL,ROTA,10.,0.,0.,0.,0,0,1
*NODE PRINT,TOTALS=YES
RF,
*EL PRINT,FREQ=0
*END STEP