*HEADING
EC38SYD5: FOUNDATION TYPE F4  [C3D8RH]
*PREPRINT,ECHO=YES,HISTORY=NO,MODEL=NO
*NODE,NSET=ALL
*ELEMENT,TYPE=C3D8RH,ELSET=A
*SOLID SECTION,MATERIAL=AMT,ELSET=A
*MATERIAL,NAME=AMT
*ELASTIC
 3.E6,0.3
*FOUNDATION
 1,F4,300.
*STEP,PERTURBATION
*STATIC
*BOUNDARY
 ALL,2,3
 ALL,1,,0.1
*EL PRINT,FREQ=0
*NODE PRINT
 RF,
*END STEP