*HEADING
EC38SID1: DLOADS AND *TEMPERATURE FOR STRESS-DISPLACEMENT ELEMENTS  [C3D8I]
*PREPRINT,ECHO=YES,HISTORY=NO,MODEL=NO
*NODE,NSET=ALL
*NSET,NSET=NS1
*NSET,NSET=NS2
*NSET,NSET=NS3
*ELEMENT,TYPE=C3D8I, ELSET=EALL
*SOLID SECTION,MATERIAL=A1, ELSET=EALL
*MATERIAL,NAME=A1
*ELASTIC
 3.E6,0.3
*DENSITY
 10.0,
*EXPANSION
 .0001,
*INITIAL CONDITIONS,TYPE=TEMPERATURE
 ALL,-10.
*BOUNDARY
 ALL,1,3
*STEP,PERTURBATION
*STATIC
*DLOAD
 1,BX,3000.
*EL PRINT,TOTALS=YES
 LOADS,
 IVOL,
 EVOL,
*NODE PRINT
 RF,
*OUTPUT,FIELD
*NODE OUTPUT
 RF,
*ELEMENT OUTPUT
 IVOL,EVOL
*OUTPUT,HISTORY
*NODE OUTPUT,NSET=ALL
 RF,
*ELEMENT OUTPUT,ELSET=EALL
 IVOL,EVOL
*ENERGY OUTPUT,VAR=ALL
*END STEP
*STEP,PERTURBATION
*STATIC
*DLOAD
 1,BY,3000.
*END STEP
*STEP,PERTURBATION
*STATIC
*DLOAD
 1,BZ,3000.
*END STEP
*STEP,PERTURBATION
*STATIC
*DLOAD
 1,GRAV,300.0,1.0,0.0,0.0
*END STEP
*STEP,PERTURBATION
*STATIC
*DLOAD
 1,CENT,300.,-1000.,3.5,-3.5,0.,1.,0.
*END STEP
*STEP,PERTURBATION
*STATIC
*DLOAD
 1,CENTRIF,30.,-1000,3.5,-3.5,0.,1.,0.
*END STEP
*STEP,PERTURBATION
*STATIC
*DLOAD
 1,P1,3000.
*END STEP
*STEP,PERTURBATION
*STATIC
*DLOAD
 1,P2,3000.
*END STEP
*STEP,PERTURBATION
*STATIC
*DLOAD
 1,P3,3000.
*END STEP
*STEP,PERTURBATION
*STATIC
*DLOAD
 1,P4,3000.
*END STEP
*STEP,PERTURBATION
*STATIC
*DLOAD
 1,P5,3000.
*END STEP
*STEP,PERTURBATION
*STATIC
*DLOAD
 1,P6,3000.
*END STEP
*STEP,PERTURBATION
*STATIC
*DLOAD
 1,HP1,3000.,0.,-7.
*END STEP
*STEP,PERTURBATION
*STATIC
*DLOAD
 1,HP2,3000.,0.,-7.
*END STEP
*STEP,PERTURBATION
*STATIC
*DLOAD
 1,HP3,3000.,0.,-7.
*END STEP
*STEP,PERTURBATION
*STATIC
*DLOAD
 1,HP4,3000.,0.,-7.
*END STEP
*STEP,PERTURBATION
*STATIC
*DLOAD
 1,HP5,3000.,0.,-7.
*END STEP
*STEP,PERTURBATION
*STATIC
*DLOAD
 1,HP6,3000.,0.,-7.
*END STEP
*STEP
*STATIC
*TEMPERATURE,OP=NEW
 ALL,30.
*EL PRINT
 S,
*NODE PRINT
 RF,
*OUTPUT,FIELD
*NODE OUTPUT
 RF,
*ELEMENT OUTPUT
 S,
*OUTPUT,HISTORY
*NODE OUTPUT,NSET=ALL
 RF,
*ELEMENT OUTPUT,ELSET=EALL
 S,
*ENERGY OUTPUT,VAR=ALL
*END STEP
*STEP
*STATIC
*BOUNDARY,OP=NEW
 NS1,1
 NS2,2
 NS3,3
*TEMPERATURE,OP=MOD
*EL PRINT,FREQ=0
*NODE PRINT
 U,
*OUTPUT,FIELD
*NODE OUTPUT
 U,
*ELEMENT OUTPUT
 S,
*OUTPUT,HISTORY
*NODE OUTPUT,NSET=ALL
 U,
*ENERGY OUTPUT,VAR=ALL
*END STEP