*HEADING
EC36SHS2: PRESSURE AND HYDROSTATIC PRESSURE FOR 3-D SOLIDS  [C3D6H]
*PREPRINT,ECHO=YES,HISTORY=YES,MODEL=YES
*NODE
*ELEMENT,TYPE=C3D6H, ELSET=EALL
*SOLID SECTION,MATERIAL=A1, ELSET=EALL
*MATERIAL,NAME=A1
*ELASTIC,TYPE=ISOTROPIC
 30.0E6,0.3
*BOUNDARY
 1,1,3
 2,2
 4,3
 5,1
*STEP
*STATIC
*DLOAD,OP=NEW
 1, P1, 1000.0
 1, P2, 1000.0
 1, P3, 1000.0
 1, P5, 1000.0
 2, P1, 1000.0
 2, P2, 1000.0
 2, P3, 1000.0
 2, P4, 1000.0
*CLOAD
  2,1,  1833.3333
  3,1,  166.6667
  3,2,  166.6667
  3,3, -1000.0000
  4,1,  833.3333
  4,2,  1833.3333
  5,2, -166.6667
  5,3,  1000.0000
*NODE PRINT
 U,COORD
*EL PRINT
 S,
 COORD,
 E,
 LOADS,
*END STEP