*HEADING
Test of angular acceleration loading for C3D6 elements.
*RESTART,WRITE
*NODE,NSET=NALL
*NGEN,NSET=NALL
*ELEMENT,TYPE=C3D6,ELSET=EALL
*SOLID SECTION,MATERIAL=STEEL,ELSET=EALL
*MATERIAL,NAME=STEEL
*ELASTIC
30.E6,.33
*DENSITY
2000.,
*BOUNDARY
NALL,1,3
*STEP
*STATIC
*DLOAD
EALL,ROTA,10.,0.,0.,0.,0,0,1
*NODE PRINT,TOTALS=YES
RF,
*EL PRINT,FREQ=0
*OUTPUT,FIELD
*NODE OUTPUT,NSET=NALL
 RF,
*OUTPUT,HISTORY
*NODE OUTPUT,NSET=NALL
 RF,
*END STEP