*HEADING
EC34SHD2: FOUNDATION TYPE F1  [C3D4H]
*PREPRINT,ECHO=YES,HISTORY=NO,MODEL=NO
*NODE,NSET=ALL
*ELEMENT,TYPE=C3D4H,ELSET=ELEMS
*SOLID SECTION,MATERIAL=MAT, ELSET=ELEMS
*MATERIAL,NAME=MAT
*ELASTIC
 3.E6,0.3
*FOUNDATION
 1,F1,300.
 3,F1,300.
*STEP,PERTURBATION
*STATIC
*BOUNDARY
 ALL,1
 ALL,2
 ALL,3,,-0.1
*EL PRINT,FREQ=0
*END STEP