*HEADING
EC34AFE1: EIGENVALUE ANALYSIS OF AN UNCONSTRAINED 1-ELEMENT MESH  [AC3D4]
*NODE, Nset=ODB_NSET
*ELEMENT,TYPE=AC3D4,ELSET=ALL
*SOLID SECTION,MATERIAL=ALL,ELSET=ALL
*MATERIAL,NAME=ALL
*DENSITY
 1.,
*ACOUSTIC MEDIUM,BULK MODULUS
**
** Sets added by addodb
**
*Elset,Elset=ODB_ESET
ALL,
**
**
*Nset, Nset=ODB_NSET
ODB_NSET,
**
**
*STEP
*FREQUENCY,EIGENSOLVER=AMS
14,,6000.,10.0,4.0,3.0
*OUTPUT,FIELD,FREQUENCY=0
*NODE PRINT,F=0
*EL PRINT,F=0
*OUTPUT,HISTORY,OP=ADD
*MODAL OUTPUT,VARIABLE=ALL
*ENDSTEP