*HEADING
EC28DFP4: PATCH TEST FOR HEAT TRANSFER ELEMENTS  [DC2D8]
*PREPRINT,ECHO=YES,HISTORY=NO,MODEL=NO
*NODE
*NGEN
*ELEMENT,TYPE=DC2D8, ELSET=EALL
*SOLID SECTION,MATERIAL=A1, ELSET=EALL
*MATERIAL,NAME=A1
*CONDUCTIVITY
4.85E-4,
*DENSITY
0.283,
*SPECIFIC HEAT
0.116,
*STEP
 STEADY STATE
*HEAT TRANSFER,STEADY STATE
*BOUNDARY
10,11, ,  0.0
20,11, , 48.0
30,11, , 60.0
40,11, , 12.0
50,11, , 24.0
60,11, , 54.0
70,11, , 36.0
80,11, ,  6.0
*NODE PRINT, FREQUENCY=0
*EL PRINT
 HFL,
*EL PRINT,POSITION=NODES
 HFL,
*EL PRINT,POSITION=AVERAGED AT NODES
 HFL,
*EL PRINT,POSITION=CENTROID
 HFL,
*EL FILE
 HFL,
*EL FILE,POSITION=NODES
 HFL,
*EL FILE,POSITION=AVERAGED AT NODES
 HFL,
*EL FILE,POSITION=CENTROID
 HFL,
*ENDSTEP