*HEADING
EC13AFE4: EIGENVALUE ANALYSIS, ACOUSTIC ORGAN PIPE MODES  [AC1D3]
*NODE, Nset=ODB_NSET
*NGEN,NSET=NALL
*ELEMENT,TYPE=AC1D3,ELSET=EALL
*ELGEN,ELSET=EALL
*MATERIAL,NAME=AIR
*DENSITY
1.293,
*ACOUSTIC MEDIUM,BULK MODULUS
*SOLID SECTION,MATERIAL=AIR,ELSET=EALL
**
** Sets added by addodb
**
*Elset,Elset=ODB_ESET
EALL,
**
**
*Nset, Nset=ODB_NSET
ODB_NSET, NALL
**
**
*STEP
 OPEN/OPEN CONDITION
*FREQUENCY, eigensolver=lanczos, SIM=NO
3, , ,1.
*BOUNDARY
1,8
21,8
*NODE PRINT
POR,PPOR
*OUTPUT,FIELD
*NODE OUTPUT
POR,
*OUTPUT,HISTORY
*MODAL OUTPUT,VARIABLE=ALL
*END STEP
*STEP
 OPEN/CLOSED CONDITION
*FREQUENCY, eigensolver=lanczos, SIM=NO
3, , ,1.
*BOUNDARY
1,8
*NODE PRINT
POR,PPOR
*OUTPUT,FIELD
*OUTPUT,HISTORY
*END STEP