*HEADING
 EC12DCDC: DFLUX, FILM, AND RADIATION FOR HEAT TRANSFER ELEMENTS  [DCC1D2]
 TEST 9-DIGIT LABELS
*PREPRINT,ECHO=YES,HISTORY=NO,MODEL=NO
*NODE,NSET=ALL
*SOLID SECTION,MATERIAL=A1, ELSET=EALL
 3.,
*ELEMENT,TYPE=DCC1D2, ELSET=EALL
*PHYSICAL CONSTANTS, ABSOLUTE ZERO=-460., STEFAN BOLTZMANN=5.0E-8
*MATERIAL,NAME=A1
*CONDUCTIVITY
 3.77E-5,
*SPECIFIC HEAT
 .39,
*DENSITY
 82.9,
*BOUNDARY
900000002, 11
*STEP
*HEAT TRANSFER,STEADY STATE
*NODE PRINT
 NT,RFL
*EL PRINT,FREQ=0
*DFLUX,OP=NEW
900000001, BF, .3
*END STEP
*STEP
*HEAT TRANSFER, STEADY STATE
*DFLUX,OP=NEW
*FILM
900000001,    F1,        75.,       .103
*END STEP
*STEP
*HEAT TRANSFER, STEADY STATE
*FILM,OP=NEW
900000001,F2,75.,.103
*BOUNDARY,OP=NEW
900000001,11
*END STEP
*STEP
*HEAT TRANSFER, STEADY STATE
*FILM, OP=NEW
*RADIATE
900000001, R1, 75., 1.E-6
*BOUNDARY,OP=NEW
900000002,11
*END STEP
*STEP
*HEAT TRANSFER, STEADY STATE
*RADIATE, OP=NEW
900000001, R2, 75., 1.E-6
*BOUNDARY,OP=NEW
900000001,11
*END STEP
*STEP
*HEAT TRANSFER, STEADY STATE
*RADIATE,OP=NEW
*DFLUX,OP=NEW
900000001, S1, .3
*BOUNDARY,OP=NEW
900000002,11
*END STEP
*STEP
*HEAT TRANSFER,STEADY STATE
*BOUNDARY,OP=NEW
900000001,11
*DFLUX,OP=NEW
900000001, S2, .3
*END STEP