*HEADING
: ARBITRARY SECTION (SLIT CIRCULAR SECTION)  [B32OS]
*NODE
*NGEN, NSET=ALL
*ELEMENT,TYPE=B32OS, ELSET=EALL
*ELSET,ELSET=FOUR
*BEAM SECTION,SECTION=ARBITRARY, TEMPERATURE=VALUES, MATERIAL=A1, ELSET=EALL
  360,  0.5000000,  0.0000100,  0.4999238,  0.0087262,  0.1000000
 0.4996954,  0.0174497,  0.1000000
 0.4993148,  0.0261680,  0.1000000
 0.4987820,  0.0348782,  0.1000000
 0.4980973,  0.0435779,  0.1000000
 0.4972609,  0.0522642,  0.1000000
 0.4962731,  0.0609347,  0.1000000
 0.4951340,  0.0695866,  0.1000000
*MATERIAL,NAME=A1
*ELASTIC
 3.E6,0.3
*BOUNDARY
1, 1, 7
*STEP,PERTURBATION
*STATIC
*LOAD CASE,NAME=BENDING
*CLOAD
 11,2,25.
*END LOAD CASE
*LOAD CASE,NAME=TORSION
*CLOAD
11,4,25.
*END LOAD CASE
*EL PRINT
 SF,
*NODE PRINT
 U1,U2,U3,COORD
 UR1,UR2,UR3,WARP,COORD
*OUTPUT,FIELD
*NODE OUTPUT
 U,
*ELEMENT OUTPUT
 SF,
*END STEP