*HEADING
EB3ITVD1: DLOADS AND *TEMPERATURE FOR STRESS-DISPLACEMENT ELEMENTS  [B32H]
*NODE,NSET=ALL
*ELEMENT,TYPE=B32H, ELSET=EALL
*BEAM SECTION,SECTION=TRAPEZOID, TEMPERATURE=VALUES,MATERIAL=A1, ELSET=EALL
2.0,3.0,2.0,1.5
*MATERIAL,NAME=A1
*ELASTIC
 3.E6, 0.3
*DENSITY
 0.16667,
*EXPANSION
 .0001,
*INITIAL CONDITIONS,TYPE=TEMPERATURE
 ALL, -10., -10., -10., -10.
*BOUNDARY
ALL,1,6
*STEP,PERTURBATION
*STATIC
*DLOAD
 1, CENT, 3000., 7.5, 0., 0.,  0., 0., 1.
*EL PRINT
 LOADS,
*END STEP
*STEP,PERTURBATION
*STATIC
*DLOAD
1,CENTRIF,3000.,7.5,0.,0.,0.,0.,1.
*END STEP
*STEP,PERTURBATION
*STATIC
*DLOAD
 1, GRAV, 1000., 1., 0., 0.
*END STEP
*STEP,PERTURBATION
*STATIC
*DLOAD
 1, PX, 1000.
*END STEP
*STEP,PERTURBATION
*STATIC
*DLOAD
 1, PY, 2000.
*END STEP
*STEP,PERTURBATION
*STATIC
*DLOAD
 1, PZ, 1000.
*END STEP
*STEP,PERTURBATION
*STATIC
*DLOAD
 1, P1, 1000.
*END STEP
*STEP,PERTURBATION
*STATIC
*DLOAD
 1, P2, 2000.
*END STEP
*STEP
*STATIC
*TEMPERATURE,OP=NEW
 ALL, 10., 10., 30., 30.
*EL PRINT
 S,
*NODE PRINT
 RF,
*END STEP
*STEP
*STATIC
*BOUNDARY,OP=NEW
1    , 1    , 6
1    , 6
*TEMPERATURE,OP=MOD
*EL PRINT,FREQ=0
*NODE PRINT
 U,
*OUTPUT,FIELD
*ELEMENT OUTPUT
 E,
*NODE OUTPUT
 U,RF
*END STEP