*HEADING
EB3ITSSD: TRAPEZOIDAL SECTION  (2x2 CROSS SECTION)  [B32H]
*NODE
*NGEN,NSET=ALL
*ELEMENT,TYPE=B32H, ELSET=EALL
*ELSET, ELSET=FOUR
*BEAM SECTION,SECTION=TRAPEZOID, TEMPERATURE=VALUES,MATERIAL=A1, ELSET=EALL
2., 2., 2., 1.
0., 0., -1.
*MATERIAL,NAME=A1
*ELASTIC
 3.E6, 0.3
*BOUNDARY
1, 1, 6
*STEP,PERTURBATION
*STATIC
*CLOAD
11,2,25.
*EL PRINT
SF,
*EL PRINT
S,E
*NODE PRINT
 U,COORD
*END STEP
*STEP,PERTURBATION
*STATIC
*CLOAD
11,4,25.
*END STEP