*HEADING
EB3IRXD3: FOUNDATION TYPE F2  [B32H]
*NODE,NSET=ALL
*ELEMENT,TYPE=B32H, ELSET=EALL
*BEAM SECTION,SECTION=RECT,MATERIAL=A1, ELSET=EALL
 2.,3.
*MATERIAL,NAME=A1
*ELASTIC
 3.E+6,0.3
*FOUNDATION
 1,F2,300.
*STEP,PERTURBATION
*STATIC
*BOUNDARY
 ALL,1
 ALL,2,,-0.1
 ALL,3,6
*EL PRINT,FREQ=0
*NODE PRINT
 RF,
*END STEP