*HEADING
EB3HPXDA: CORIOLIS LOAD  [B31H]
*NODE,NSET=NALL
*ELEMENT,TYPE=B31H, ELSET=EALL
*BEAM SECTION,SECTION=PIPE,MATERIAL=A1, ELSET=EALL
10.,1.
*MATERIAL,NAME=A1
*ELASTIC
30.E6,
*STEP
*STATIC
1.0,1.0
*BOUNDARY
 NALL,1,1,10.
 NALL,2,2,5.
 NALL,3,3,2.
 NALL,4,6
*EL PRINT
 LOADS,
*NODE PRINT
 RF,
*DLOAD
1,CORIO,5.,0.,0.,0.,1.,5.,20.
*OUTPUT,HISTORY
*NODE OUTPUT,NSET=NALL
 U,RF1,RF2,RF3,
*END STEP