*HEADING
EB3ARMS7: VERIFICATION OF INITIAL CURVATURE OF BEAMS AND SHELLS  [B33]
*NODE
*ELEMENT,TYPE=B33, ELSET=EALL
*NORMAL
*BEAM SECTION, SECTION=RECT,MATERIAL=A1, ELSET=EALL
 0.5, 0.5
 0.0, 0.0, -1.0
*MATERIAL,NAME=A1
*ELASTIC,TYPE=ISOTROPIC
 30.0E6, 0.3
*BOUNDARY
 1, 1,6
*STEP,PERTURBATION
*STATIC
*CLOAD
 2,1,  25.0
*EL PRINT,FREQ=0
*END STEP