*HEADING
EB32RXS7: SHEAR FLEXIBLE BEAMS AND SHELLS - II  [B31]
*NODE
*ELEMENT,TYPE=B31, ELSET=EALL
*BEAM SECTION, SECTION=RECT,MATERIAL=A1, ELSET=EALL
 0.5, 0.5
 0.0, 0.0, -1.0
*TRANSVERSE SHEAR STIFFNESS
2.4519E6,2.4519E6,0.3269
*MATERIAL,NAME=A1
*ELASTIC,TYPE=ISOTROPIC
 30.0E6,0.3
*BOUNDARY
 1,1,6
*STEP,PERTURBATION
*STATIC
*CLOAD
 2,2,1E5
*OUTPUT,FIELD
*NODE OUTPUT
U
*NODE PRINT
U2
*END STEP