*HEADING
EB32AISD: ARBITRARY SECTION (I)  [B31]
*NODE
*NGEN,NSET=ALL
*ELEMENT,TYPE=B31, ELSET=EALL
*ELSET, ELSET=FOUR
*BEAM SECTION,SECTION=ARBITRARY, TEMPERATURE=VALUES,MATERIAL=A1, ELSET=EALL
5, -1.5, -.9428572, 1.5, -.9428572, .2
0., -.9428572, 0.
0., 1.2571428, .2
1.0, 1.2571428, 0.
-1.0, 1.2571428, .2
0., 0., -1.
*MATERIAL,NAME=A1
*ELASTIC
 3.E6, 0.3
*BOUNDARY
1, 1, 6
*STEP,PERTURBATION
*STATIC
*LOAD CASE,NAME=BENDING
*CLOAD
11,2,25.
*END LOAD CASE
*LOAD CASE,NAME=TORSION
*CLOAD
11,4,25.
*END LOAD CASE
*EL PRINT
SF,
*NODE PRINT
 U,COORD
*OUTPUT,FIELD
*NODE OUTPUT
U,
*ELEMENT OUTPUT
S,
*END STEP