*HEADING
DUCT_ACIN2D2 [AC2D4]
*PREPRINT,MODEL=NO,HISTORY=NO
*NODE, NSET=ODB_NSET
*NGEN,NSET=NALL
*ELEMENT,TYPE=AC2D4,ELSET=EALL
*ELGEN,ELSET=EALL
*NCOPY,CHANGENUMBER=500,OLDSET=NALL,NEWSET=INF,SHIFT
*ELCOPY,ELEMENTSHIFT=500,OLDSET=EALL,NEWSET=INF,SHIFTNODES=500
*ELEMENT,TYPE=ACIN2D2,ELSET=INF
*ELSET,ELSET=LINER3
*MATERIAL,NAME=AIR320
*DENSITY
1.25,
*ACOUSTIC MEDIUM,BULK MODULUS
*SOLID SECTION,MATERIAL=AIR320,ELSET=EALL
*SOLIDSECTION,MATERIAL=AIR320,ELSET=INF
*NSET,NSET=QA_TEST,GEN
*NSET,NSET=DRIV
*NSET,NSET=DRIV2
*AMPLITUDE,DEFINITION=PERIO,NAME=COSINE
1,10.00,0.0,0.0
0.0,1.0,
***************************************
*STEP
*STEADY STATE DYNAMIC,DIRECT
*CLOAD
DRIV,8,1.
*IMPEDANCE,OP=NEW
LINER3,I3
*NODE PRINT,NSET=QA_TEST
POR,
*OUTPUT,FIELD
*NODE OUTPUT
POR,
*OUTPUT,HISTORY
*NODE OUTPUT,NSET=QA_TEST
POR,
*END STEP
***************************************
*STEP,INC=200
*DYNAMIC,DIRECT
1.0e-5,1.0e-3
*CLOAD,OP=NEW,AMPLITUDE=COSINE
DRIV,8,1.0
*IMPEDANCE,OP=NEW
LINER3,I3
*NODE PRINT,NSET=QA_TEST,FREQ=40
POR,
*OUTPUT,FIELD,FREQUENCY=40
*NODE OUTPUT
POR,
*OUTPUT,HISTORY,OP=NEW,FREQ=40
*NODE OUTPUT,NSET=QA_TEST
POR,
*END STEP