*HEADING
 PRESSURIZED RUBBER DISC --- S4R ELEMENTS
*NODE,NSET=TOP
*NGEN,LINE=C,NSET=TOP
*NGEN,NSET=TOP
*ELEMENT,TYPE=S4R
*ELGEN,ELSET=SHEET
*ELEMENT,TYPE=S4R,ELSET=SHEET
*ELEMENT,TYPE=S4R
*ELGEN,ELSET=SHEET
*NSET,NSET=XFIX,GEN
*NSET,NSET=YFIX,GEN
*NSET,NSET=HINGE,GEN
*NSET,NSET=QA_TEST_OUT
TOP,
*BOUNDARY
XFIX,XSYMM
YFIX,YSYMM
HINGE,1,3
*SHELL SECTION, SECTION INT=GAUSS,ELSET=SHEET,MATERIAL=A1,ORIENTATION=ORI,
CONTROLS=HGLASS
0.5,5
*SECTION CONTROLS,HOURGLASS=ENHANCED,NAME=HGLASS
*ORIENTATION,NAME=ORI,SYSTEM=CYLINDRICAL
*MATERIAL,NAME=A1
*DENSITY
1.E-4,
*HYPERELASTIC,N=1
80.,20.,
*AMPLITUDE,NAME=RAMP
0.,0., .01,1.
**
*STEP
*DYNAMIC,EXPLICIT
,0.01
*DLOAD,AMP=RAMP
SHEET,P,46.
*MONITOR,NODE=1,DOF=3
**
*OUTPUT,FIELD,NUMBER INTERVAL=1
*ELEMENT OUTPUT
 PRESS,
 MISES,
*NODE OUTPUT
 U,
**
*OUTPUT,HISTORY,TIME INTERVAL=0.005
*ELEMENT OUTPUT,ELSET=SHEET
 S,PRESS,LE,NE
*NODE OUTPUT,NSET=TOP
 U,
**
**
** OUTPUT FOR QA TESTING
**
*FILE OUTPUT,TIMEMARKS=YES,NUMBER INTERVAL=1
*NODE FILE
 U,
*OUTPUT,FIELD,TIMEMARKS=YES,NUMBER INTERVAL=1
*NODE OUTPUT, NSET=QA_TEST_OUT
 U,
***OUTPUT,HISTORY,VAR=ALL,TIME INTERVAL=0.005
*OUTPUT,HISTORY,TIME INTERVAL=0.005
*ELEMENT OUTPUT, VAR=ALL, ELSET=SHEET
*NODE OUTPUT, VAR=ALL, NSET=TOP
*END STEP