*HEADING
cube: C3D8; fixed time inc; cyclic displacement loading
and fixed Fourier terms
*NODE,NSET=NALL
*ELEMENT,TYPE=C3D8,ELSET=EALL
*SOLID SECTION, ELSET=EALL, MATERIAL=STEEL
1
*MATERIAL,NAME=STEEL
*ELASTIC
60000.0 , 0.33
*PLASTIC,HARDENING=KINEMATIC
  62   ,  0  ,   20
 382.1 , .1  ,   20
  45   ,  0  ,  100
 305.1 , .1  ,  100
  32   ,  0  ,  150
 202.1 , .1  ,  150
  28   ,  0  ,  200
 163   , .1  ,  200
*BOUNDARY
1,1,3
2,1,3
3,1,3
4,1,3
*MPC
tie,6,5
tie,7,5
tie,8,5
*AMPLITUDE,NAME=AMP
0,0 , 10,1 ,30,-1 , 40,0
*STEP,INC=1000
*DIRECT CYCLIC
*BOUNDARY,AMP=AMP
5,3,3,0.01
*print,freq=20
*NODE print
RF
U
*el print
E
PEEQ
*OUTPUT,FIELD,FREQ=1,var=preselect
*output,history,freq=1
*element output,elset=eall
s
e
pe
*node output,nset=nall
u
rf
*END STEP