*Heading
** Job name: wicking_c3d4p_deform Model name: Model-1
** Generated by: Abaqus/CAE 6.10-EFR
*Preprint, echo=NO, model=NO, history=NO, contact=NO
**
** PARTS
**
*Part, name=Part-1
*End Part
**
**
** ASSEMBLY
**
*Assembly, name=Assembly
**
*Instance, name=Part-1-1, part=Part-1
*Node
*Element, type=C3D4P
*Nset, nset=_PickedSet2, internal, generate
*Elset, elset=_PickedSet2, internal, generate
** Section: Section-1
*Solid Section, elset=_PickedSet2, material=Material-1
*End Instance
**
*Nset, nset=Bottom, instance=Part-1-1
*Elset, elset=Bottom, instance=Part-1-1
*Nset, nset=Nall, instance=Part-1-1, generate
*Elset, elset=Nall, instance=Part-1-1, generate
*Nset, nset=Block, instance=Part-1-1, generate
*Elset, elset=Block, instance=Part-1-1, generate
*Nset, nset=Bottom_PP_, internal, instance=Part-1-1
*End Assembly
**
** MATERIALS
**
*Material, name=Material-1
*Elastic
 1.3e3,0.
*Density
 1.5,
*Porous Bulk Moduli
*Permeability,Specific=10.
 4.5e-6,
*Permeability,Type=Saturation
 .666666,.85
 1.,1.
*Sorption
*Sorption,Type=Exsorption
*Initial Conditions, type=Saturation
 Nall, 1.
*Initial Conditions, type=Pore pressure
 Nall, 0.
*Initial Conditions, type=Ratio
 Nall, .4235
*Initial Conditions, type=stress, geostatic
 Block, 0.,1.,-17.9750615,0.,0.,0.
*Boundary
 Nall, 1,2
 Bottom_PP_, 3,3
** ----------------------------------------------------------------
**
** STEP: Step-1
**
*Step, name=Step-1
 Geostatic Loading
*Geostatic
1e-06, 1e-06, 1e-11, 1e-06
**
** LOADS
**
** Name: Load-1   Type: Gravity
*Dload
, GRAV, 10., 0., 0., -1.
*Boundary
 Nall, 8,8,0.
**
** OUTPUT REQUESTS
**
*Restart, write, frequency=0
**
** FIELD OUTPUT: F-Output-1
**
*Output, field, frequency=10
*Node Output
 POR, U
*Element Output, directions=YES
 S, SAT
*End Step
** ----------------------------------------------------------------
**
** STEP: Step-2
**
*Step, name=Step-2
Consolidation
*Soils, consolidation, end=PERIOD, utol=10.
*Boundary, Op=New
 Bottom_PP_, 8,8,0.
 Nall,1,2,0.
 Bottom_PP_,3,3,0.
*Output, field
*Node Output
 POR, U
*Element Output, directions=YES
 S, SAT
*End Step