*HEADING
 A one element (CPS4R) input deck to test composite damage model
 testing effect of fiber orientation (0 degree: fiber tension)
*PREPRINT,ECHO=YES,HISTORY=YES
**--------------------------------------------- Part1
*PART,NAME=PART-1
  *NODE
  *ELEMENT,TYPE=CPS4R
  *ELSET,ELSET=EA
  *SOLID SECTION,ELSET=EA,MATERIAL=GLASS_EPOXY,ORIENT=RECT
   1.,
  *NSET,NSET=Left
  *NSET,NSET=bot
  *nset, nset=right
  *ORIENTATION,NAME=RECT
*END PART
**--------------------------------------------- Assembly-1
*ASSEMBLY,NAME=ASSEMBLY-1
*INSTANCE,NAME=PART-1-1,PART=PART-1
*END INSTANCE
*END ASSEMBLY
**--------------------------------------------- End Assembly
*MATERIAL,NAME=GLASS_EPOXY
*ELASTIC,TYPE=LAMINA
 53.8e9,17.9e9,0.25,8.96e9,8.96e9,6.88e9
**<E11>,<E22>,<nu12>,<G12>,<G13>,<G23>
*DAMAGE INITIATION,CRITERION=HASHIN,ALPHA=0.0
 1034e6,1034e6,27.6e6,138e6,41.4e6,69e6
** <X_T>,<X_C>,<Y_T>,<Y_C>,<S_L>,<S_T>
*DAMAGE EVOLUTION, TYPE=ENERGY, SOFTENING=LINEAR
 20e6,20e6,4.0e4,1.0e6
*STEP,INC=200
 SMALL DISPLACEMENT ANALYSIS
*STATIC
 0.0001,0.01,,0.0002
*BOUNDARY
 ASSEMBLY-1.PART-1-1.right,1,1,0.05
 ASSEMBLY-1.PART-1-1.left,1,1
 ASSEMBLY-1.PART-1-1.bot, 2,2
*OUTPUT,FIELD,FREQ=100
*ELEMENT OUTPUT
 E,
 DAMAGEFT,
 DAMAGESHR,
*NODE OUTPUT
 U,
*OUTPUT,HISTORY
*ELEMENT OUTPUT,ELSET=PART-1-1.EA
 ELDMD,
 HSNFTCRT,
 S,
 E,
 DAMAGEFT,
 DAMAGESHR,
*EL PRINT
 HSNFTCRT
*END STEP