*HEADING
 THICK CYLINDER - INTERNAL PRESSURE  (CAXA8H1)
*NODE
*NGEN,NSET=SIDE1
*NGEN
*NSET,NSET=BORE1
*ELEMENT,TYPE=CAXA8H1,OFFSET=1000
*ELGEN,ELSET=EALL
*ELSET,ELSET=PRIN
*NSET,NSET=SIDE,GENERATE
*NSET,NSET=BORE
*SOLID SECTION,MATERIAL=A1,ELSET=EALL
*MATERIAL,NAME=A1
*ELASTIC
30.E6,.3
*PLASTIC
30000.,
** Axisymmetric constraints
*EQUATION
*BOUNDARY
SIDE,2
*STEP,NLGEOM,INC=50
*STATIC
.1,1.
*BOUNDARY
BORE,1,1,20.
*PRINT,RESIDUAL=NO
*NODE PRINT
U,RF
*EL PRINT,ELSET=PRIN,POSITION=CENTROIDAL,SUMMARY=NO
S,MISES,
E,
*NODE FILE,NSET=BORE
U,
RF,
*EL FILE,ELSET=PRIN,POSITION=CENTROIDAL
S,
** Selective output
*OUTPUT,HISTORY,FREQ=6
*NODE OUTPUT,NSET=SIDE
U1,U2,RF1,RF2
*OUTPUT,FIELD,FREQ=6
*ELEMENT OUTPUT,ELSET=EOUT
S,LE,SINV,PE
*ELSET,ELSET=EOUT
*END STEP