*HEADING
360 DEGREES MODEL CORRESPONDING TO 2X2 MESH OF DC3D8 ELEMENTS
 corresponds to cyclicsym_dc3d8_heat_SRADIATE
*PREPRINT, ECHO=YES, MODEL=YES, HISTORY=YES
*NODE
*ELEMENT, TYPE=DC3D8, ELSET=EALL
*NSET, NSET=NBC
*ELSET,ELSET=SIDE
*SURFACE, NAME=SIDE,  TYPE=ELEMENT
15,S2
5,S1
9,S2
10,S2
13,S2
14,S2
7,S2
11,S2
*SOLID SECTION, ELSET=EALL,MATERIAL=MAT
*PHYSICAL CONSTANT, ABSOLUTE ZERO=-460., STEFAN BOLTZMAN=5.0E-8
*MATERIAL,NAME=MAT
*CONDUCTIVITY
3.77E-5,
*SPECIFIC HEAT
.39,
*DENSITY
82.9,
*STEP
*HEAT TRANSFER,STEADY STATE
*BOUNDARY
NBC,11,11,
*SRADIATE
SIDE,R,75,1E-6
*END STEP