*HEADING
360 DEGREES MODEL CORRESPONDING TO 2X2 MESH OF DC2D8 ELEMENTS
 corresponds to cyclicsym_dc2d8_heat.inp
*PREPRINT, ECHO=YES, MODEL=YES, HISTORY=YES
*NODE
*ELEMENT, TYPE=DC2D8
*ELSET, ELSET=EALL, GENERATE
*NSET, NSET=NBC
*NSET, NSET=TEMP2
*NSET, NSET=TEMP1,GEN
*NSET, NSET=TEMP
TEMP1,TEMP2
*SOLID SECTION, ELSET=EALL,MATERIAL=MAT
1.,
*MATERIAL,NAME=MAT
*CONDUCTIVITY
100.0,
*BOUNDARY
NBC,11,11,
*STEP
*HEAT TRANSFER,STEADY STATE
*BOUNDARY
TEMP,11,11,180.
*OUTPUT, FIELD
*NODE OUTPUT
NT,
*ELEMENT OUTPUT
HFL,
*EL PRINT
HFL,
*NODE PRINT
NT11,
*END STEP