*HEADING
ELEMENT TESTED      : CPE8R
SLAVE SURFACE TYPE  : NODE
MASTER SURFACE TYPE : NODE
*PREPRINT, ECHO=YES, MODEL=YES, HISTORY=YES
*SYSTEM
*NODE
*ELEMENT, TYPE=CPE8R, ELSET=EALL
*NSET, NSET=NBC
*NSET, NSET=NMASTER
*NSET, NSET=NSLAVE
*SURFACE, NAME=SMASTER, TYPE=NODE
NMASTER,
*SURFACE, NAME=SSLAVE, TYPE=NODE
NSLAVE,
*SOLID SECTION, ELSET=EALL,MATERIAL=MAT
1.,
*MATERIAL,NAME=MAT
*ELASTIC
10E8,0.3
*DENSITY
100,
*TIE, CYCLICSYM, POSITION=0.5,  NAME=TIE1
 SSLAVE, SMASTER
*CYCLIC SYMMETRY MODEL,N=12
*STEP
*FREQUENCY,EIGENSOLVER=LANCZOS
12,
*OUTPUT, FIELD, FREQUENCY=0
*END STEP