*HEADING
360 DEGREES STATIC NONLINEAR ANALYSIS THAT FORMS THE BASIS FOR
THE REZONED ANALYSIS cyclicsym_cpe4r_360_rezone.inp
**
*RESTART, WRITE, OVERLAY
*PREPRINT, ECHO=YES, MODEL=YES, HISTORY=YES
*NODE
*ELEMENT, TYPE=CPE4R
*ELSET, ELSET=EALL, GENERATE
*NSET, NSET=NBC
*SOLID SECTION, ELSET=EALL,MATERIAL=MAT
1.,
*MATERIAL,NAME=MAT
*ELASTIC
10E8,0.3
*DENSITY
100,
*BOUNDARY
NBC, 1,2, 0
*NSET, NSET=NCLOAD
*STEP, NLGEOM
*STATIC
0.1, 1.0
*CLOAD
900000011, 1, 1E10
900000003, 2, 1E10
900000004, 1, -1E10
900000008, 2, -1E10
**OUTPUT, FIELD, FREQUENCY=0
*END STEP