*Heading
Test of Surface generated by Cutting plane method (ABAQUS/Explicit)
Elements Tested: T2D2,B21,B22,CAX3,CAX6M
*Node
*Element, type=Cax3,elset=cax3
*Element, type=B21,elset=b12
*Element, type=B22,elset=b22
*Element, type=T2D2,elset=t2d2
*Element, type=Cax6M,elset=cax6M
*Element, type=PIPE21,elset=p12
*elset,elset=allax
cax3,cax6M
*elset,elset=allbeams
b12,b22,p12
*elset,elset=alltruss
t2d2
*Solid Section, elset=allax, material=STEEL
1.,
*Beam Section, elset=allbeams, material=STEEL, section=PIPE
1.0, 0.1
0.,0.,-1.
*Solid Section, elset=alltruss, material=STEEL
1.,
*SURFACE, TYPE=CUTTING SURFACE, NAME=PARALLEL_Axsym_POS
allax
*SURFACE, TYPE=CUTTING SURFACE, NAME=PARALLEL_Axsym_neg
allax
*SURFACE, TYPE=CUTTING SURFACE, NAME=angle_Axsym_pos
allax
*SURFACE, TYPE=CUTTING SURFACE, NAME=angle_Axsym_neg
allax
**
*SURFACE, TYPE=CUTTING SURFACE, NAME=PARALLEL_beam_POS
allbeams
*SURFACE, TYPE=CUTTING SURFACE, NAME=PARALLEL_beam_neg
allbeams
*SURFACE, TYPE=CUTTING SURFACE, NAME=angle_beam_pos
allbeams
*SURFACE, TYPE=CUTTING SURFACE, NAME=angle_beam_neg
allbeams
**
*SURFACE, TYPE=CUTTING SURFACE, NAME=PARALLEL_truss_POS
alltruss
*SURFACE, TYPE=CUTTING SURFACE, NAME=PARALLEL_truss_neg
alltruss
*SURFACE, TYPE=CUTTING SURFACE, NAME=angle_truss_pos
alltruss
*SURFACE, TYPE=CUTTING SURFACE, NAME=angle_truss_neg
alltruss
*preprint,model=yes,history=yes
**
** MATERIALS
**
*Material, name=STEEL
*Elastic
 2.1e+11, 0.3
*density
7800
*nset,nset=fix
*nset,nset=boun
*step
*DYNAMIC,EXPLICIT
,0.001
*boundary,type=vel
19,1,1,1
119,1,1,1
23,1,1,1
boun,2,2,1
*boundary
fix,1,6
*end step