*Heading
Test of Surface generated by Cutting plane method
Elements Tested:DC3D8,DC3D20,DC3D6,DC3D4,DC3D15,DC3D10
**
** PARTS
**
*Part, name=Part-1
*End Part
**
**
** ASSEMBLY
**
*Assembly, name=Assembly
**
*Instance, name=Part-1-1, part=Part-1
*Node
*Element, type=DC3D8
** Region: (Section-1:Picked)
*Elset, elset=_PickedSet2, internal, generate
** Section: Section-1
*Solid Section, elset=_PickedSet2, material=steel
1.,
*End Instance
**
*Instance, name=Part-1-2, part=Part-1
*Node
*Element, type=DC3D20
** Region: (Section-1:Picked)
*Elset, elset=_PickedSet2, internal, generate
** Section: Section-1
*Solid Section, elset=_PickedSet2, material=steel
1.,
*End Instance
**
*Instance, name=Part-1-3, part=Part-1
*Node
*Element, type=DC3D4
** Region: (Section-1:Picked)
*Elset, elset=_PickedSet2, internal, generate
** Section: Section-1
*Solid Section, elset=_PickedSet2, material=steel
1.,
*End Instance
**
*Instance, name=Part-1-4, part=Part-1
*Node
*Element, type=DC3D6
** Region: (Section-1:Picked)
*Elset, elset=_PickedSet2, internal, generate
** Section: Section-1
*Solid Section, elset=_PickedSet2, material=steel
1.,
*End Instance
**
*Instance, name=Part-1-5, part=Part-1
*Node
*Element, type=DC3D15
** Region: (Section-1:Picked)
*Elset, elset=_PickedSet2, internal, generate
** Section: Section-1
*Solid Section, elset=_PickedSet2, material=steel
1.,
*End Instance
**
*Instance, name=Part-1-6, part=Part-1
*Node
*Element, type=DC3D10
** Region: (Section-1:Picked)
*Elset, elset=_PickedSet2, internal, generate
** Section: Section-1
*Solid Section, elset=_PickedSet2, material=steel
1.,
*End Instance
**
*Nset, nset=upper, instance=Part-1-1, generate
*Nset, nset=upper, instance=Part-1-2
*Nset, nset=upper, instance=Part-1-4, generate
*Nset, nset=upper, instance=Part-1-6
*Nset, nset=upper, instance=Part-1-3
*Nset, nset=upper, instance=Part-1-5
*Nset, nset=lower, instance=Part-1-1, generate
*Nset, nset=lower, instance=Part-1-2
*Nset, nset=lower, instance=Part-1-4, generate
*Nset, nset=lower, instance=Part-1-6
*Nset, nset=lower, instance=Part-1-3
*Nset, nset=lower, instance=Part-1-5
*Nset, nset=all, instance=Part-1-1, generate
*Nset, nset=all, instance=Part-1-2, generate
*Nset, nset=all, instance=Part-1-4, generate
*Nset, nset=all, instance=Part-1-6, generate
*Nset, nset=all, instance=Part-1-3, generate
*Nset, nset=all, instance=Part-1-5, generate
*Elset, elset=all, instance=Part-1-1, generate
*Elset, elset=all, instance=Part-1-2, generate
*Elset, elset=all, instance=Part-1-4, generate
*Elset, elset=all, instance=Part-1-6, generate
*Elset, elset=all, instance=Part-1-3, generate
*Elset, elset=all, instance=Part-1-5, generate
*SURFACE, TYPE=CUTTING SURFACE, NAME=PARALLEL_solid_POS
all
*SURFACE, TYPE=CUTTING SURFACE, NAME=angle_solid_pos
all
*SURFACE, TYPE=CUTTING SURFACE, NAME=PARALLEL_solid_NEG
*SURFACE, TYPE=CUTTING SURFACE, NAME=angle_solid_NEG
*End Assembly
**
** MATERIALS
**
*Material, name=steel
*Elastic
 2.1e+11, 0.3
*conductivity
586
** ----------------------------------------------------------------
**
** STEP: Step-1
**
*Step, name=Step-1
*heat transfer,steady state
0.1,1
**
** BOUNDARY CONDITIONS
**
** Name: Disp-BC-1 Type: Symmetry/Antisymmetry/Encastre
*Boundary
upper,11,,170
lower,11,,100
*Restart, write, frequency=1
**
** FIELD OUTPUT: F-Output-1
**
*Output, field, variable=PRESELECT
**
** HISTORY OUTPUT: H-Output-1
**
*Output, history, variable=PRESELECT
*El Print, freq=999999
*Node Print, freq=999999
*End Step