*Heading
** Job name: elliptic Model name: Model-1
** Generated by: Abaqus/CAE 6.9-EFR
*Preprint, echo=NO, model=NO, history=no
**
** PARTS
**
*Part, name=Part-1
*End Part
**
*Part, name=Part-2
*End Part
**
**
** ASSEMBLY
**
*Assembly, name=Assembly
**
*Instance, name=Part-1-1, part=Part-1
*End Instance
**
*Instance, name=Part-1-2, part=Part-1
*Node
*Element, type=C3D8
*Nset, nset=_PickedSet2, internal, generate
*Elset, elset=_PickedSet2, internal, generate
*elset,elset=wrong
*elset,elset=verywrong
*elset,elset=asymphantom
*elset,elset=asym
*elset,elset=tip
*nset,nset=asymnode
** Section: Section-1
*Solid Section, elset=_PickedSet2, material=Material-1
*End Instance
**
*Instance, name=Part-2-1, part=Part-2
*End Instance
**
*Nset, nset=_PickedSet8, internal, instance=Part-1-2
*Elset, elset=_PickedSet8, internal, instance=Part-1-2
*Nset, nset=_PickedSet9, internal, instance=Part-1-2
*Nset, nset=_PickedSet10, internal, instance=Part-1-2
*Nset, nset=_PickedSet12, internal, instance=Part-1-2, generate
*Elset, elset=_PickedSet12, internal, instance=Part-1-2, generate
*Elset, elset=__PickedSurf11_S3, internal, instance=Part-1-2
*Elset, elset=__PickedSurf11_S4, internal, instance=Part-1-2, generate
*Elset, elset=__PickedSurf11_S2, internal, instance=Part-1-2
*Elset, elset=__PickedSurf11_S1, internal, instance=Part-1-2, generate
*Surface, type=ELEMENT, name=_PickedSurf11, internal
__PickedSurf11_S3, S3
__PickedSurf11_S4, S4
__PickedSurf11_S2, S2
__PickedSurf11_S1, S1
*Enrichment, name=Crack-1, type=STATIONARY CRACK, elset=_PickedSet12
*End Assembly
**
** MATERIALS
**
*Material, name=Material-1
*Elastic
 3e+07, 0.3
*Initial condition, type=ENRICHMENT
Part-1-2.33663, 1, Crack-1, 0.980394, 0.6314
Part-1-2.33663, 2, Crack-1, 0.980392, -1.8602
Part-1-2.33663, 3, Crack-1, 0.98039, -1.23008
Part-1-2.33663, 4, Crack-1, 0.980389, 0.829374
Part-1-2.33663, 5, Crack-1, -0.980394, 0.6314
Part-1-2.33663, 6, Crack-1, -0.980392, -1.8602
Part-1-2.33663, 7, Crack-1, -0.980394, -1.23154
Part-1-2.33663, 8, Crack-1, -0.980392, 0.82697
Part-1-2.33673, 1, Crack-1, 0.980389, 0.829374
Part-1-2.33673, 2, Crack-1, 0.98039, -1.23008
Part-1-2.33673, 3, Crack-1, 0.980389, -0.127892
Part-1-2.33673, 4, Crack-1, 0.980389, 1.58115
Part-1-2.33673, 5, Crack-1, -0.980392, 0.82697
Part-1-2.33673, 6, Crack-1, -0.980394, -1.23154
Part-1-2.33673, 7, Crack-1, -0.980393, -0.12889
Part-1-2.33673, 8, Crack-1, -0.980393, 1.57838
Part-1-2.33683, 1, Crack-1, 0.980389, 1.58115
Part-1-2.33683, 2, Crack-1, 0.980389, -0.127892
Part-1-2.33683, 3, Crack-1, 0.980389, 1.02881
Part-1-2.33683, 4, Crack-1, 0.980389, 2.96236
** ... 348 like lines cut
**
** BOUNDARY CONDITIONS
**
** Name: BC-1 Type: Symmetry/Antisymmetry/Encastre
*Boundary
_PickedSet8, XSYMM
** Name: BC-2 Type: Displacement/Rotation
*Boundary
_PickedSet9, 2, 2
** Name: BC-3 Type: Displacement/Rotation
*Boundary
_PickedSet10, 3, 3
** ----------------------------------------------------------------
**
** STEP: Step-1
**
*Step, name=Step-1
*Static
1., 1., 1e-05, 1.
**
** LOADS
**
** Name: Load-1   Type: Pressure
*Dsload
_PickedSurf11, P, -100.
**
** OUTPUT REQUESTS
**
*Restart, write, frequency=0
**
** FIELD OUTPUT: F-Output-1
**
*output, field
*elementoutput
S, STATUSXFEM
*nodeoutput
U, PHILSM,PSILSM
**
** HISTORY OUTPUT: H-Output-1
**
*Output, history
*contour integral,contour=5,crack name=Crack-1,xfem
*End Step