*HEADING
  DLOAD, DSLOAD  AND *TEMPERATURE FOR COH3D8
*PREPRINT, MODEL=YES
*NODE,NSET=ALL
*NSET,NSET=TOP
*NSET,NSET=BOTTOM
*NSET,NSET=RIGHT
*NSET,NSET=LEFT
*ELEMENT,TYPE=COH3D8P, ELSET=EALL,OFFSET=10
*SURFACE, NAME=SIDE1
1, S1
*SURFACE, NAME=SIDE2
1, S2
*SURFACE, NAME=SIDE3
1, S3
*SURFACE, NAME=SIDE4
1, S4
*SURFACE, NAME=SIDE5
1, S5
*SURFACE, NAME=SIDE6
1, S6
*COHESIVE SECTION, THICKNESS=GEOMETRY, MATERIAL=COH, ELSET=EALL, RESPONSE=CONTINUUM
*MATERIAL,NAME=COH
*ELASTIC
3.E6, 0.3
*DENSITY
 10.0,
*EXPANSION
 .0001,
*INITIAL CONDITIONS, TYPE=TEMPERATURE
ALL, 0.0
*BOUNDARY
 ALL,1,3
*NSET, NSET=QA_TEST_ALL
ALL
*ELSET, ELSET=QA_TEST_EALL
EALL
***************************
** 	STEP-1
***************************
*STEP, NLGEOM=YES, UNSYMM=YES, NAME=BX
*SOILS, CONSOLIDATION, END=PERIOD, UTOL=1E+06
*DLOAD,OP=NEW
 1,BX,3000.
*OUTPUT, FIELD
*ELEMENT OUTPUT, ELSET=QA_TEST_EALL
 S
*NODE OUTPUT, NSET=QA_TEST_ALL
 RF
*OUTPUT, HISTORY, FREQUENCY=0
*EL PRINT
 LOADS
*NODE PRINT
 RF,
*END STEP
***************************
** 	STEP-2
***************************
*STEP, NLGEOM=YES, UNSYMM=YES, NAME=BY
*SOILS, CONSOLIDATION, END=PERIOD, UTOL=1E+06
*DLOAD,OP=NEW
 1,BY,3000.
*END STEP
***************************
** 	STEP-3
***************************
*STEP, NLGEOM=YES, UNSYMM=YES, NAME=BZ
*SOILS, CONSOLIDATION, END=PERIOD, UTOL=1E+06
*DLOAD,OP=NEW
 1,BZ,3000.
*END STEP
***************************
** 	STEP-4
***************************
*STEP, NLGEOM=YES, UNSYMM=YES, NAME=GRAV
*SOILS, CONSOLIDATION, END=PERIOD, UTOL=1E+06
*DLOAD,OP=NEW
 1,GRAV,300.0,0.0,1.0,0.0
*END STEP
***************************
** 	STEP-5
***************************
*STEP, NLGEOM=YES, UNSYMM=YES, NAME=CENT
*SOILS, CONSOLIDATION, END=PERIOD, UTOL=1E+06
*DLOAD,OP=NEW
1, CENT, 300., 3.5, -1000., 3.5, 1., 0., 0.
*END STEP
***************************
** 	STEP-6
***************************
*STEP, NLGEOM=YES, UNSYMM=YES, NAME=CENTRIF
*SOILS, CONSOLIDATION, END=PERIOD, UTOL=1E+06
*DLOAD,OP=NEW
1, CENTRIF, 30., 3.5, -1000., 3.5, 1., 0., 0.
*END STEP
***************************
** 	STEP-7
***************************
*STEP, NLGEOM=YES, UNSYMM=YES, NAME=ROTA
*SOILS, CONSOLIDATION, END=PERIOD, UTOL=1E+06
*DLOAD,OP=NEW
 1, ROTA, 10., 3.5, -1000., 3.5, 1., 0., 0.
*END STEP
***************************
** 	STEP-8
***************************
*STEP, NLGEOM=YES, UNSYMM=YES, NAME=P1
*SOILS, CONSOLIDATION, END=PERIOD, UTOL=1E+06
*DLOAD,OP=NEW
 1,P1,3000.
*END STEP
***************************
** 	STEP-9
***************************
*STEP, NLGEOM=YES, UNSYMM=YES, NAME=P2
*SOILS, CONSOLIDATION, END=PERIOD, UTOL=1E+06
*DLOAD,OP=NEW
 1,P2,3000.
*END STEP
***************************
** 	STEP-10
***************************
*STEP, NLGEOM=YES, UNSYMM=YES, NAME=P3
*SOILS, CONSOLIDATION, END=PERIOD, UTOL=1E+06
*DLOAD,OP=NEW
 1,P3,3000.
*END STEP
***************************
** 	STEP-11
***************************
*STEP, NLGEOM=YES, UNSYMM=YES, NAME=P4
*SOILS, CONSOLIDATION, END=PERIOD, UTOL=1E+06
*DLOAD,OP=NEW
 1,P4,3000.
*END STEP
***************************
** 	STEP-12
***************************
*STEP, NLGEOM=YES, UNSYMM=YES, NAME=P5
*SOILS, CONSOLIDATION, END=PERIOD, UTOL=1E+06
*DLOAD,OP=NEW
 1,P5,3000.
*END STEP
***************************
** 	STEP-13
***************************
*STEP, NLGEOM=YES, UNSYMM=YES, NAME=P6
*SOILS, CONSOLIDATION, END=PERIOD, UTOL=1E+06
*DLOAD,OP=NEW
 1,P6,3000.
*END STEP
***************************
** 	STEP-14
***************************
*STEP, NLGEOM=YES, UNSYMM=YES, NAME=S1
*SOILS, CONSOLIDATION, END=PERIOD, UTOL=1E+06
*DLOAD,OP=NEW
*DSLOAD,OP=NEW
 SIDE1,P,3000.
*END STEP
***************************
** 	STEP-15
***************************
*STEP, NLGEOM=YES, UNSYMM=YES, NAME=S2
*SOILS, CONSOLIDATION, END=PERIOD, UTOL=1E+06
*DSLOAD,OP=NEW
 SIDE2,P,3000.
*END STEP
***************************
** 	STEP-16
***************************
*STEP, NLGEOM=YES, UNSYMM=YES, NAME=S3
*SOILS, CONSOLIDATION, END=PERIOD, UTOL=1E+06
*DSLOAD,OP=NEW
 SIDE3,P,3000.
*END STEP
***************************
** 	STEP-17
***************************
*STEP, NLGEOM=YES, UNSYMM=YES, NAME=S4
*SOILS, CONSOLIDATION, END=PERIOD, UTOL=1E+06
*DSLOAD,OP=NEW
 SIDE4,P,3000.
*END STEP
***************************
** 	STEP-18
***************************
*STEP, NLGEOM=YES, UNSYMM=YES, NAME=S5
*SOILS, CONSOLIDATION, END=PERIOD, UTOL=1E+06
*DSLOAD,OP=NEW
 SIDE5,P,3000.
*END STEP
***************************
** 	STEP-19
***************************
*STEP, NLGEOM=YES, UNSYMM=YES, NAME=S6
*SOILS, CONSOLIDATION, END=PERIOD, UTOL=1E+06
*DSLOAD,OP=NEW
 SIDE6,P,3000.
*END STEP
***************************
** 	STEP-20
***************************
*STEP, NLGEOM=YES, UNSYMM=YES, NAME=TEMP_ALL
*SOILS, CONSOLIDATION, END=PERIOD, UTOL=1E+06
*TEMPERATURE
 ALL,50.
*OUTPUT, FIELD
*ELEMENT OUTPUT, ELSET=QA_TEST_EALL
TEMP, S, E
*NODE OUTPUT, NSET=QA_TEST_ALL
U, RF
*EL PRINT
 S, TEMP
*NODE PRINT
 RF,
*END STEP
***************************
** 	STEP-21
***************************
*STEP, NLGEOM=YES, UNSYMM=YES, NAME=TEMP_TOP
*SOILS, CONSOLIDATION, END=PERIOD, UTOL=1E+06
*BOUNDARY,OP=NEW
 BOTTOM, 1, 3, 0.0
 TOP, 1, 1, 0.0
 TOP, 3, 3, 0.0
*TEMPERATURE,OP=MOD
 TOP, 50.0
*OUTPUT, FIELD
*ELEMENT OUTPUT, ELSET=QA_TEST_EALL
TEMP, S, E
*NODE OUTPUT, NSET=QA_TEST_ALL
U, RF
*EL PRINT
 S, TEMP
*NODE PRINT
 RF,
*END STEP
***************************
** 	STEP-22
***************************
*STEP, NLGEOM=YES, UNSYMM=YES, NAME=TEMP_-TOP
*SOILS, CONSOLIDATION, END=PERIOD, UTOL=1E+06
*TEMPERATURE,OP=MOD
 TOP, 0.0
*END STEP
***************************
** 	STEP-23
***************************
*STEP, NLGEOM=YES, UNSYMM=YES, NAME=TEMP_RIGHT
*SOILS, CONSOLIDATION, END=PERIOD, UTOL=1E+06
*TEMPERATURE,OP=MOD
 RIGHT, 50.0
*END STEP
***************************
** 	STEP-24
***************************
*STEP, NLGEOM=YES, UNSYMM=YES, NAME=TEMP_-RIGHT
*SOILS, CONSOLIDATION, END=PERIOD, UTOL=1E+06
*TEMPERATURE,OP=MOD
 RIGHT, 0.0
*END STEP