*HEADING
 CONTOUR INTEGRALS
 SINGLE EDGE NOTCH SPECIMEN: a/W=0.5, H/W=2
 File name: cintegral2d_1edge_cpe8.inp
*NODE
*NGEN,NSET=END1
*NGEN,NSET=END2
*NFILL
END1,END2,6,1
*NGEN,NSET=TIP
*NGEN,NSET=OUTER
*NFILL,SINGULAR=1
TIP,OUTER,6,1
*ELEMENT,TYPE=CPE8
**ELEMENT,TYPE=CPS8
*ELGEN,ELSET=EALL
*NSET,NSET=XAXIS,GENERATE
*NSET,NSET=YAXIS
*ELSET,ELSET=PULL
*NSET,NSET=CRACK,GENERATE
*SOLID SECTION,MATERIAL=A1,ELSET=EALL
1.,
*MATERIAL,NAME=A1
*ELASTIC
30.E6,.3
*BOUNDARY
XAXIS,2
YAXIS,1
*STEP
*STATIC
*DLOAD
PULL,P2,-1.
*CONTOUR INTEGRAL,FREQUENCY=1,CONTOURS=3,SYMM,OUTPUT=BOTH,TYPE=J
CRACK, 1.0, 0.0
*CONTOUR INTEGRAL,FREQUENCY=1,CONTOURS=3,SYMM,OUTPUT=BOTH,TYPE=K FACTORS
CRACK, 1.0, 0.0
*CONTOUR INTEGRAL,FREQUENCY=1,CONTOURS=3,SYMM,OUTPUT=BOTH,TYPE=T-STRESS
CRACK, 1.0, 0.0
*NODE PRINT,freq=0
U,RF
*EL PRINT,freq=0
S,E
*NODE FILE,freq=0
U,
EL FILE,freq=0
S,
*END STEP