*HEADING
 CAST IRON PLASTICITY
 BIAXIAL TENSION--COFFIN'S EXPERIMENTAL DATA
*NODE,NSET=ALL
*NSET,NSET=FACE1
*NSET,NSET=FACE2
*NSET,NSET=FACE3
*NSET,NSET=FACE4
*NSET,NSET=FACE42
*NSET,NSET=FACE5
*NSET,NSET=FACE6
*EQUATION
FACE42,1,1, 2,1,-1
*ELEMENT,TYPE=C3D8,ELSET=ONE
*SOLID SECTION,ELSET=ONE,MATERIAL=TREL
*MATERIAL,NAME=TREL
*DENSITY
1.0
*ELASTIC
14.773E6,0.2273
*CAST IRON PLASTICITY
*CAST IRON TENSION HARDENING
*CAST IRON COMPRESSION HARDENING
*AMPLITUDE, NAME=AMP-1
 0.0,0.0,1.0,1.0
*STEP
Step: BIAXIAL TENSION
*DYNAMIC, EXPLICIT
 ,1.
*BOUNDARY,OP=NEW
FACE1,3
FACE3,2
FACE6,1
*DLOAD, AMPLITUDE=AMP-1
ONE,P4,-27.5E+03
ONE,P5,-13.75E+03
*OUTPUT,FIELD
*NODE OUTPUT,NSET=ALL
U,RF
*ELEMENT OUTPUT,ELSET=ONE
S,LE,PE,PEEQ,PEEQT
*OUTPUT,HISTORY
*NODE OUTPUT, NSET=ALL
U,RF
*ELEMENT OUTPUT, ELSET=ONE
S,SINV,LE,PE,PEEQ,PEEQT
*END STEP