*HEADING
/Explicit ADAPTIVE MESHING verification (Units: N,m)
Material Testing for Hill Plasticity
Two step analysis to test effect of mesh smoothing
*RESTART,WRITE,NUMBER=10
*NODE
*NGEN, NSET=BOT
*NGEN, NSET=TOP
*NGEN,NSET=RIGHT
*NGEN,NSET=LEFT
*NFILL, NSET=NALL
BOT, TOP, 4, 5
*NODE
*ELEMENT,TYPE=CPE4R
*ELEMENT,TYPE=CPS4R
*ELGEN, ELSET=EGPE
*ELGEN, ELSET=EPS
*NSET,NSET=QA_TEST_NALL
NALL
*ELSET,ELSEt=QA_TEST_EALL
EGPE,
EPS,
****************************************
**local orientation matching global system
*ORIENTATION,NAME=RECT
*SOLID SECTION,MATERIAL=MAT1,ELSET=EGPE,CONTROL=SECT,ORIENT=RECT
0.12,
*SOLID SECTION,MATERIAL=MAT1,ELSET=EPS,CONTROL=SECT,ORIENT=RECT
0.12,
*SECTION CONTROLS, NAME=SECT,HOURGLASS=STIFFNESS
*MATERIAL,NAME=MAT1
*ELASTIC
3.0E6,0.3
*PLASTIC
0.15E5, 0.0
0.6E5,  1.0
*POTENTIAL
*DENSITY
500.,
*AMPLITUDE, TIME=TOTAL TIME, NAME=AMP,DEFINITION=SMOOTH STEP
0.0, 0.0, 1.0, 1.0, 4.0, 1.0
*BOUNDARY
LEFT, 1, 1, 0.0
TOP,  2, 2, 0.0
BOT,  1, 1, 0.0
RIGHT,1, 1, 0.0
*STEP
*DYNAMIC,EXPLICIT
,1.1
*BOUNDARY, TYPE=DISPLACEMENT, AMPLITUDE=AMP
1,2,2,0.
2,2,2,-.20
3,2,2,-.40
4,2,2,-.60
5,2,2,-.80
101,2,2,0.
102,2,2,-.20
103,2,2,-.40
*FILE OUTPUT, NUM=1, TIMEMARKS=NO
*NODE FILE
 U,
*EL FILE
PEEQ,
*ENERGY FILE
ALLIE,ALLKE,ALLWK,ETOTAL,ALLPD
*OUTPUT,FIELD,NUMBER INTERVAL=2,VARIABLE=PRESELECT
*OUTPUT,FIELD,NUMBER INTERVAL=1
*NODE OUTPUT,NSET=QA_TEST_NALL
 U
*ELEMENT OUTPUT,ELSET=QA_TEST_EALL
PEEQ
*OUTPUT,HISTORY,VARIABLE=PRESELECT,TIMEINT=1.1
*END STEP
*STEP
*DYNAMIC,EXPLICIT
,1.
*ADAPTIVEMESH,ELSET=EGPE,FREQUENCY=1,INITIALMES=1
*ADAPTIVEMESH,ELSET=EPS,FREQUENCY=1,INITIALMES=1
*END STEP