*Heading
Job name: ale_cpe4ht Model name: Model-1
*Preprint, echo=NO, model=NO, history=NO, contact=NO
**
** PARTS
**
*Part, name=Part-1
*End Part
**
**
** ASSEMBLY
**
*Assembly, name=Assembly
**
*Instance, name=Part-1-1, part=Part-1
*Node
*Element, type=CPE4HT
** Region: (Section-1:Picked)
*Elset, elset=_PickedSet2, internal, generate
** Section: Section-1
*Solid Section, elset=_PickedSet2, material=Material-1
1.,
*End Instance
**
*Nset, nset=_PickedSet4, internal, instance=Part-1-1, generate
*Elset, elset=_PickedSet4, internal, instance=Part-1-1, generate
*Nset, nset=_PickedSet5, internal, instance=Part-1-1, generate
*Elset, elset=_PickedSet5, internal, instance=Part-1-1, generate
*Nset, nset=_PickedSet6, internal, instance=Part-1-1, generate
*Elset, elset=_PickedSet6, internal, instance=Part-1-1, generate
*Elset, elset=Adapt,  instance=Part-1-1, generate
*Nset, nset=_PickedSet7, internal, instance=Part-1-1, generate
*Elset, elset=_PickedSet7, internal, instance=Part-1-1, generate
*Nset, nset=_PickedSet6_PP_, internal, instance=Part-1-1, generate
*Nset, nset=_PickedSet7_PP_, internal, instance=Part-1-1, generate
*Nset, nset=NALL, instance=Part-1-1, generate
*Elset, elset=heat, instance=Part-1-1,generate
*Surface, Type=Element, Name=Heat
heat, S3
*End Assembly
**
** MATERIALS
**
*Material, name=Material-1
*Density
4.6,
*Elastic
10000.0, 0.2
*Plastic
250.0, 0.00
500.0, 0.06
*Conductivity
20.0,
*Specific heat
1.0
*Expansion
0.1,
*Initial Conditions, Type=Temperature
NALL, 1.0
** ----------------------------------------------------------------
**
** STEP: Step-1
**
*Step, name=Step-1, nlgeom=YES
Gravity Loading
*Coupled Temperature-Displacement, deltmx=1.0
0.2, 8.0, 1e-05, 1.
**
** BOUNDARY CONDITIONS
**
** Name: BC-1 Type: Displacement/Rotation
*Boundary
_PickedSet4, 2, 2
** Name: BC-2 Type: Displacement/Rotation
*Boundary
_PickedSet5, 1, 1
** Name: BC-3 Type: Pore pressure
*Boundary
_PickedSet6_PP_, 8, 8, -15.
** Name: BC-4 Type: Pore pressure
*Boundary
_PickedSet7_PP_, 8, 8
**
** LOADS
**
** Name: Load-1   Type: Gravity
*Dload
, GRAV, 2.0, , 1.
*Dsflux
Heat, S, 20.0
**
** OUTPUT REQUESTS
**
*Restart, write, frequency=0
**
** FIELD OUTPUT: F-Output-1
**
*Output, field, variable=PRESELECT
**
** HISTORY OUTPUT: H-Output-1
**
*Output, history, variable=PRESELECT
*Adaptive Mesh, Elset=Adapt, Freq=1, Mesh=10
*End Step